>Не получается собрать wine вер. 0.19.17 ! При выполнении make depend все
>заканчивается:
>gcc -g -O2 -o widl client.o hash.o header.o proxy.o server.o typegen.o typelib.o
>utils.o widl.o write_msft.o parser.tab.o lex.yy.o -L../../libs -lwpp -lwine_port -lfl
>../../libs/libwpp.a(lex.yy.o)(.text+0x624): In function `_yy_dummy_uses_of_static_functions_b2f4_517d_02ff_b30c_3e5a_47d7_aaa3_3b5d_':
>/home/dima/wine-0.9.17/libs/wpp/lex.yy.c:3358: multiple definition of `_yy_dummy_uses_of_static_functions_b2f4_517d_02ff_b30c_3e5a_47d7_aaa3_3b5d_'
>lex.yy.o(.text+0x58c):/home/dima/wine-0.9.17/tools/widl/lex.yy.c:1796: first defined here
>collect2: ld returned 1 exit status
>make[2]: *** [widl] Ошибка 1
>make[2]: Leaving directory `/home/dima/wine-0.9.17/tools/widl'
>make[1]: *** [widl] Ошибка 2
>make[1]: Leaving directory `/home/dima/wine-0.9.17/tools'
>make: *** [tools] Ошибка 2 This is not a Wine bug but a bug in the FC4 flex update flex-2.5.4a-35.fc4 .
See https://bugzilla.redhat.com/bugzilla/show_bug.cgi?id=177813
A fixed rpm was released but didn't make it yet to the main updates dir.
Upgrade to at least
http://download.fedora.redhat.com/pub/fedora/linux/core/updates/testing/4/i386/flex-2.5.4a-36.fc4.i386.rpm
and Wine will build again.
вот так вот