The OpenNET Project / Index page

[ новости /+++ | форум | теги | ]

форумы  помощь  поиск  регистрация  майллист  вход/выход  слежка  RSS
"установка RSBAC"
Вариант для распечатки  
Пред. тема | След. тема 
Форумы Открытые системы на рабочей станции (Public)
Изначальное сообщение [ Отслеживать ]

"установка RSBAC"  +/
Сообщение от kopernik21187 email(ok) on 22-Окт-09, 12:57 
Добрый день! устанавливаю RSBAC:

  \opt\qtsdk-2009.03\qt\bin:kostya:/usr/src/linux/rsbac-admin-1.4.2# make install

Installing RSBAC headers...
-------------------------------------
  INTO         (/usr/local)
  DIR         //usr/local/include/rsbac
  INSTALL    rsbac/aci_data_structures.h
  INSTALL    rsbac/acl_getname.h
  INSTALL    rsbac/acl_types.h
  INSTALL    rsbac/auth_data_structures.h
  INSTALL    rsbac/cap_getname.h
  INSTALL    rsbac/debug.h
  INSTALL    rsbac/error.h
  INSTALL    rsbac/fs.h
  INSTALL    rsbac/gen_lists.h
  INSTALL    rsbac/getname.h
  INSTALL    rsbac/helpers.h
  INSTALL    rsbac/jail_getname.h
  INSTALL    rsbac/net_getname.h
  INSTALL    rsbac/network.h
  INSTALL    rsbac/network_types.h
  INSTALL    rsbac/pax_getname.h
  INSTALL    rsbac/pax.h
  INSTALL    rsbac/pm_getname.h
  INSTALL    rsbac/pm_ticket.h
  INSTALL    rsbac/pm_types.h
  INSTALL    rsbac/rc_data_structures.h
  INSTALL    rsbac/rc_getname.h
  INSTALL    rsbac/rc_types.h
  INSTALL    rsbac/reg.h
  INSTALL    rsbac/reg_main.h
  INSTALL    rsbac/repl_lists.h
  INSTALL    rsbac/repl_types.h
  INSTALL    rsbac/request_groups.h
  INSTALL    rsbac/res_getname.h
  INSTALL    rsbac/syscall_rsbac.h
  INSTALL    rsbac/syscalls.h
  INSTALL    rsbac/types.h
  INSTALL    rsbac/um.h
  INSTALL    rsbac/um_types.h

Building RSBAC Libraries...
-------------------------------------

Installing RSBAC libraries...
-------------------------------------
  INTO         (/usr/local)
  DIR        /usr/local/lib
  INSTALL    librsbac.la
libtool: install: warning: remember to run `libtool --finish /usr/local/lib'
  LIBTOOL    librsbac.la

Building RSBAC PAM...
-------------------------------------

Installing RSBAC PAM...
-------------------------------------
  INTO        
  DIR        /lib/security
  INSTALL    pam_rsbac.so pam_rsbac_oldpw.so
  DIR        /usr/local/share/locale
  INSTALL    de fr

Building rklogd and rklogd-viewer...
-------------------------------------
viewer/rklogd-viewer.c:8:20: error: curses.h: Нет такого файла или каталога
viewer/rklogd-viewer.c:19: error: expected ‘=’, ‘,’, ‘;’, ‘asm’ or ‘__attribute__’ before ‘*’ token
viewer/rklogd-viewer.c:39: error: expected ‘)’ before ‘*’ token
viewer/rklogd-viewer.c: In function ‘print_time’:
viewer/rklogd-viewer.c:140: error: ‘stdscr’ undeclared (first use in this function)
viewer/rklogd-viewer.c:140: error: (Each undeclared identifier is reported only once
viewer/rklogd-viewer.c:140: error: for each function it appears in.)
viewer/rklogd-viewer.c:140: error: ‘A_BOLD’ undeclared (first use in this function)
viewer/rklogd-viewer.c:141: error: ‘LINES’ undeclared (first use in this function)
viewer/rklogd-viewer.c:141: error: ‘COLS’ undeclared (first use in this function)
viewer/rklogd-viewer.c:145: error: ‘top_win’ undeclared (first use in this function)
viewer/rklogd-viewer.c: In function ‘print_menu_top’:
viewer/rklogd-viewer.c:155: error: ‘top_win’ undeclared (first use in this function)
viewer/rklogd-viewer.c:158: error: ‘COLOR_BLACK’ undeclared (first use in this function)
viewer/rklogd-viewer.c:158: error: ‘COLOR_CYAN’ undeclared (first use in this function)
viewer/rklogd-viewer.c:207: error: ‘COLS’ undeclared (first use in this function)
viewer/rklogd-viewer.c: In function ‘print_menu’:
viewer/rklogd-viewer.c:219: error: ‘COLS’ undeclared (first use in this function)
viewer/rklogd-viewer.c:222: error: ‘top_win’ undeclared (first use in this function)
viewer/rklogd-viewer.c:225: error: ‘COLOR_CYAN’ undeclared (first use in this function)
viewer/rklogd-viewer.c:225: error: ‘COLOR_BLACK’ undeclared (first use in this function)
viewer/rklogd-viewer.c:226: error: ‘stdscr’ undeclared (first use in this function)
viewer/rklogd-viewer.c:227: error: ‘LINES’ undeclared (first use in this function)
viewer/rklogd-viewer.c: In function ‘print_view’:
viewer/rklogd-viewer.c:239: error: ‘COLS’ undeclared (first use in this function)
viewer/rklogd-viewer.c:239: error: ‘LINES’ undeclared (first use in this function)
viewer/rklogd-viewer.c:242: error: ‘view_win’ undeclared (first use in this function)
viewer/rklogd-viewer.c:248: error: ‘win’ undeclared (first use in this function)
viewer/rklogd-viewer.c:254: error: ‘top_win’ undeclared (first use in this function)
viewer/rklogd-viewer.c:266: error: ‘COLOR_CYAN’ undeclared (first use in this function)
viewer/rklogd-viewer.c:266: error: ‘COLOR_BLACK’ undeclared (first use in this function)
viewer/rklogd-viewer.c:271: error: ‘ACS_VLINE’ undeclared (first use in this function)
viewer/rklogd-viewer.c:271: error: ‘ACS_HLINE’ undeclared (first use in this function)
viewer/rklogd-viewer.c: At top level:
viewer/rklogd-viewer.c:282: error: expected ‘)’ before ‘*’ token
viewer/rklogd-viewer.c: In function ‘print_log_line’:
viewer/rklogd-viewer.c:360: error: ‘win’ undeclared (first use in this function)
viewer/rklogd-viewer.c:361: error: ‘COLS’ undeclared (first use in this function)
viewer/rklogd-viewer.c: In function ‘light_fill_view’:
viewer/rklogd-viewer.c:379: error: ‘win’ undeclared (first use in this function)
viewer/rklogd-viewer.c:383: error: ‘COLOR_YELLOW’ undeclared (first use in this function)
viewer/rklogd-viewer.c:383: error: ‘COLOR_BLACK’ undeclared (first use in this function)
viewer/rklogd-viewer.c:388: error: ‘LINES’ undeclared (first use in this function)
viewer/rklogd-viewer.c: In function ‘fill_view’:
viewer/rklogd-viewer.c:409: error: ‘win’ undeclared (first use in this function)
viewer/rklogd-viewer.c:412: error: ‘COLOR_YELLOW’ undeclared (first use in this function)
viewer/rklogd-viewer.c:412: error: ‘COLOR_BLACK’ undeclared (first use in this function)
viewer/rklogd-viewer.c: In function ‘select_line’:
viewer/rklogd-viewer.c:448: error: ‘COLOR_BLACK’ undeclared (first use in this function)
viewer/rklogd-viewer.c:448: error: ‘COLOR_YELLOW’ undeclared (first use in this function)
viewer/rklogd-viewer.c:449: error: ‘win’ undeclared (first use in this function)
viewer/rklogd-viewer.c: In function ‘scroll_view’:
viewer/rklogd-viewer.c:489: error: ‘LINES’ undeclared (first use in this function)
viewer/rklogd-viewer.c:496: error: ‘win’ undeclared (first use in this function)
viewer/rklogd-viewer.c: In function ‘about_win’:
viewer/rklogd-viewer.c:509: error: ‘WINDOW’ undeclared (first use in this function)
viewer/rklogd-viewer.c:509: error: ‘tmp_win’ undeclared (first use in this function)
viewer/rklogd-viewer.c:514: error: ‘LINES’ undeclared (first use in this function)
viewer/rklogd-viewer.c:515: error: ‘COLS’ undeclared (first use in this function)
viewer/rklogd-viewer.c:516: error: ‘COLOR_WHITE’ undeclared (first use in this function)
viewer/rklogd-viewer.c:516: error: ‘COLOR_BLACK’ undeclared (first use in this function)
viewer/rklogd-viewer.c:519: error: ‘ACS_VLINE’ undeclared (first use in this function)
viewer/rklogd-viewer.c:519: error: ‘ACS_HLINE’ undeclared (first use in this function)
viewer/rklogd-viewer.c:524: error: ‘A_BOLD’ undeclared (first use in this function)
viewer/rklogd-viewer.c:539: error: ‘win’ undeclared (first use in this function)
viewer/rklogd-viewer.c: In function ‘help_win’:
viewer/rklogd-viewer.c:546: error: ‘WINDOW’ undeclared (first use in this function)
viewer/rklogd-viewer.c:546: error: ‘tmp_win’ undeclared (first use in this function)
viewer/rklogd-viewer.c:552: error: ‘LINES’ undeclared (first use in this function)
viewer/rklogd-viewer.c:553: error: ‘COLS’ undeclared (first use in this function)
viewer/rklogd-viewer.c:554: error: ‘COLOR_WHITE’ undeclared (first use in this function)
viewer/rklogd-viewer.c:554: error: ‘COLOR_BLACK’ undeclared (first use in this function)
viewer/rklogd-viewer.c:557: error: ‘ACS_VLINE’ undeclared (first use in this function)
viewer/rklogd-viewer.c:557: error: ‘ACS_HLINE’ undeclared (first use in this function)
viewer/rklogd-viewer.c:562: error: ‘A_BOLD’ undeclared (first use in this function)
viewer/rklogd-viewer.c:575: error: ‘win’ undeclared (first use in this function)
viewer/rklogd-viewer.c: In function ‘stat_deny_win’:
viewer/rklogd-viewer.c:660: error: ‘WINDOW’ undeclared (first use in this function)
viewer/rklogd-viewer.c:660: error: ‘tmp_win’ undeclared (first use in this function)
viewer/rklogd-viewer.c:666: error: ‘LINES’ undeclared (first use in this function)
viewer/rklogd-viewer.c:667: error: ‘COLS’ undeclared (first use in this function)
viewer/rklogd-viewer.c:670: error: ‘ACS_VLINE’ undeclared (first use in this function)
viewer/rklogd-viewer.c:670: error: ‘ACS_HLINE’ undeclared (first use in this function)
viewer/rklogd-viewer.c:671: error: ‘A_BOLD’ undeclared (first use in this function)
viewer/rklogd-viewer.c:733: error: ‘win’ undeclared (first use in this function)
viewer/rklogd-viewer.c: In function ‘data_win’:
viewer/rklogd-viewer.c:741: error: ‘WINDOW’ undeclared (first use in this function)
viewer/rklogd-viewer.c:741: error: ‘tmp_win’ undeclared (first use in this function)
viewer/rklogd-viewer.c:748: error: ‘LINES’ undeclared (first use in this function)
viewer/rklogd-viewer.c:749: error: ‘COLS’ undeclared (first use in this function)
viewer/rklogd-viewer.c:752: error: ‘ACS_VLINE’ undeclared (first use in this function)
viewer/rklogd-viewer.c:752: error: ‘ACS_HLINE’ undeclared (first use in this function)
viewer/rklogd-viewer.c:755: error: ‘COLOR_RED’ undeclared (first use in this function)
viewer/rklogd-viewer.c:755: error: ‘COLOR_BLACK’ undeclared (first use in this function)
viewer/rklogd-viewer.c:759: error: ‘A_BOLD’ undeclared (first use in this function)
viewer/rklogd-viewer.c:858: error: ‘win’ undeclared (first use in this function)
viewer/rklogd-viewer.c: In function ‘main’:
viewer/rklogd-viewer.c:1037: error: ‘win’ undeclared (first use in this function)
viewer/rklogd-viewer.c:1037: error: ‘TRUE’ undeclared (first use in this function)
viewer/rklogd-viewer.c:1038: error: ‘stdscr’ undeclared (first use in this function)
viewer/rklogd-viewer.c:1051: error: ‘KEY_DOWN’ undeclared (first use in this function)
viewer/rklogd-viewer.c:1054: error: ‘LINES’ undeclared (first use in this function)
viewer/rklogd-viewer.c:1061: error: ‘KEY_UP’ undeclared (first use in this function)
viewer/rklogd-viewer.c:1072: error: ‘KEY_RIGHT’ undeclared (first use in this function)
viewer/rklogd-viewer.c:1073: error: ‘COLS’ undeclared (first use in this function)
viewer/rklogd-viewer.c:1080: error: ‘KEY_LEFT’ undeclared (first use in this function)
viewer/rklogd-viewer.c:1094: error: case label does not reduce to an integer constant
viewer/rklogd-viewer.c:1097: error: case label does not reduce to an integer constant
viewer/rklogd-viewer.c:1100: error: case label does not reduce to an integer constant
viewer/rklogd-viewer.c:1103: error: case label does not reduce to an integer constant
viewer/rklogd-viewer.c:1109: error: case label does not reduce to an integer constant
make[1]: *** [viewer/rklogd-viewer.o] Ошибка 1
make: *** [rklogd] Ошибка 2


не могу понять где взять rklogd-viewer сами пакеты klog, klogd, sysklogd уже установлены, на репозиториях дебиановских я его не нашёл! установка затормозилась! те кто уже устанавливал RSBAC подскажите пожалуйста где взять данный пакет! :(
ОС Debian Lenny 5.0.2
   С уважением, Константин
Высказать мнение | Ответить | Правка | Cообщить модератору

Оглавление

Сообщения по теме [Сортировка по времени | RSS]


1. "установка RSBAC"  +/
Сообщение от kopernik21187 email(??) on 22-Окт-09, 14:06 
Проблема решена! доставил пакеты связанные с файлом curses.h
libcurses-ocaml,libcurses-ocaml-dev,libcurses-perl,libcurses-ruby плюс пакет dialog и все заработало :)))
Высказать мнение | Ответить | Правка | Наверх | Cообщить модератору

Архив | Удалить

Индекс форумов | Темы | Пред. тема | След. тема




Партнёры:
PostgresPro
Inferno Solutions
Hosting by Hoster.ru
Хостинг:

Закладки на сайте
Проследить за страницей
Created 1996-2025 by Maxim Chirkov
Добавить, Поддержать, Вебмастеру